{"text_format":"1","workbook":"xlsx","n_sheets":6,"sheets":["Disclaimer","Input","Output","Assumptions","Calculation","Version Control"],"not_rendered":{"charts":0,"images":0,"macros":1,"external_links":0,"defined_names":2,"comments":0,"pivot_tables":0},"unopened":[],"bounds":{"document_bytes":16777216,"sheet_cells":100000,"rows_first":2000,"rows_last":500,"rows_between":2000,"halvings":0,"cell_chars":16384,"cell_head_chars":4096},"cells_cut":0,"cells_raw":0,"read":"row_number_cap","date_system":"1900"}

{"sheet":"Disclaimer","index":0,"n_rows":2,"n_cols":2,"rows_kept":2,"cut":false,"hidden":false,"merged":[]}
[]
[null," "]

{"sheet":"Input","index":1,"n_rows":148,"n_cols":7,"rows_kept":148,"cut":false,"hidden":false,"merged":[[43,1,44,7],[0,1,2,7],[40,2,40,7],[3,2,3,7],[24,2,24,7],[16,2,16,7],[20,2,20,7],[29,2,29,7],[8,2,8,7]],"read":"row_number_cap"}
[null,"SINGLE PUBLIC SERVICE PENSION SCHEME (THE \"SINGLE SCHEME\") \nINPUTS"]
[]
[]
[null,null,"This Tool is designed to give a broad indication of the retirement benefits of members of the Single Scheme at normal retirement age. The outputs from the Estimator Tool are not a guarantee of the retirement benefits payable at your normal retirement age. For a broad estimate of your projected Single Scheme benefits, please provide the following information:"]
[]
[]
[null,null,"Membership Type"]
[null,null,"Select",null,{"$f":"IF(D8=\"\",\"Enter Member Type Here\",\"\")","v":"Enter Member Type Here"}]
[]
[]
[null,null,"Retirement Age"]
[null,null,"Retirement Age"]
[]
[]
[null,null,"Full-Time Gross Annual Pensionable Pay (€)"]
[null,null,"€",null,{"$f":"IF(E20=\"\",\"\",\"Enter Full-Time Annual Pensionable Pay here\")","v":"Enter Full-Time Annual Pensionable Pay here"}]
[null,null,"Include all of your approved pensionable allowances"]
[]
[null,null,"% Work Pattern or Full Time Equivalent (FTE)"]
[null,null,"%",null,{"$f":"IF(D20<1,\"If your work pattern is less than 100%, make sure you enter the equivalent Full Time Pensionable Pay you would receive if you worked a full time pattern in the field Full Time Gross Annual Pensionable Pay above\",\"\")","v":"If your work pattern is less than 100%, make sure you enter the equivalent Full Time Pensionable Pay you would receive if you worked a full time pattern in the field Full Time Gross Annual Pensionable Pay above"}]
[null,null,"Enter your % work pattern, to a maximum of 100%"]
[]
[null,null,"Year of Birth"]
[null,null,"Year"]
[]
[]
[null,null,"Year of Entry to the Single Scheme"]
[null,null,"Year",null,"In order to give as complete an estimate as possible you should select the year when you first entered pensionable, Single Scheme employment. "]
[]
[]
[null,null,"Work Pattern and Full Time Pensionable Pay in previous years"]
[null,null,"Year","Annual Work Pattern (%)","Full-Time Gross Annual Pensionable Pay(€)"]
[null,null,2013]
[null,null,2014]
[null,null,2015]
[null,null,2016]
[null,null,2017]
[null,null,2018]
[null,null,2019]
[null,null,2020]
{"$rows_left_out":109}
{"sheet":"Output","index":2,"n_rows":54,"n_cols":8,"rows_kept":54,"cut":false,"hidden":false,"merged":[[38,5,38,6],[36,2,36,6],[31,2,31,6],[0,1,0,7],[16,2,16,6],[19,2,19,6],[15,2,15,6],[1,2,3,7],[8,2,8,6],[6,5,6,6],[35,1,35,7],[28,2,28,4]]}
[null,{"$f":"Input!D8 & \" SINGLE SCHEME ESTIMATOR TOOL - RESULTS\"","v":" SINGLE SCHEME ESTIMATOR TOOL - RESULTS"}]
[null,null,"See below an estimate of your projected Single Scheme benefits, in present day money terms,  based on information you have provided and assumptions listed."]
[]
[]
[]
[null,null,"Contributions This Year"]
[null,null,"Scheme Contributions",null,null,"Additional Superannuation Contribution (ASC)"]
[null,null,"€",{"$f":"Calculation!H42+Calculation!I42","v":0}," ","€",{"$f":"Calculation!J42","v":0}]
[null,null,{"$f":"\"Based on your inputs, you are projected to pay €\"&TEXT(ROUND(D8,0),\"##,###\")& \" in employee contributions and €\"&TEXT(ROUND(G8,0),\"##,###\")&\" in Additional Superannuation Contributions over the next 12 months.\"","v":"Based on your inputs, you are projected to pay € in employee contributions and € in Additional Superannuation Contributions over the next 12 months."}]
[]
[null,null,"Retirement Benefits Built Up This Year"]
[null,null,{"$f":"\"Your normal retirement age is: \"&Calculation!AA5","v":"Your normal retirement age is: 66"}]
[]
[null,null,"Retirement Pension Benefit ",null,null,"Retirement Lump Sum Benefit"]
[null,null,"€",{"$f":"Calculation!O40","v":0},"p.a.","€",{"$f":"Calculation!M40","v":0}]
[null,null,{"$f":"\"On the basis of your inputs, you are expected to build up €\"&TEXT(ROUND($D$15,2),\"##,###\")&\" towards your annual pension entitlement and €\"&TEXT(ROUND($G$15,2),\"##,###\")&\" towards your retirement lump sum payment over the next 12 months.\"","v":"On the basis of your inputs, you are expected to build up € towards your annual pension entitlement and € towards your retirement lump sum payment over the next 12 months."}]
[null,null,{"$f":"\"The benefits built-up above will be payable from your normal retirement age, i.e. age \"&Calculation!AA5&\". Your pension and lump sum benefits will be uprated in line with changes in the Consumer Price Index between the year of building up these benefits and the year of your retirement.\"","v":"The benefits built-up above will be payable from your normal retirement age, i.e. age 66. Your pension and lump sum benefits will be uprated in line with changes in the Consumer Price Index between the year of building up these benefits and the year of your retirement."}]
[]
[null,null,"Estimated Benefits At Retirement"]
[null,null,"Please refer to all assumptions for further detail on how these estimates have been derived."]
[]
[null,null,"Normal Retirement Year",null,null,"Year ",{"$f":"Calculation!AA7","v":66}]
[]
[null,null,"Single Scheme Retirement Lump Sum",null,null,"€",{"$f":"Calculation!AA15","v":0}]
[]
[null,null,"Single Scheme Annual Retirement Pension",null,null,"€",{"$f":"Calculation!AA14","v":0},"p.a."]
[]
[null,null,"Annual Contributory State Pension",null,null,"€",{"$f":"Calculation!G14","v":12956.294},"p.a."]
[null,null,"You are assumed to be eligible to receive the full State Pension (Contributory) from your state pension eligibility age. Your Single Scheme Normal Retirement Age and the State Pension (Contributory) eligibility age are not the same if you are a Uniformed member.  However for all other membership types, the eligibility age for the State Pension (Contributory) and the minimum Single Scheme normal retirement age are the same. "]
[null,null,"Today's Date",null,null,null,{"$f":"TODAY()","v":"2021-05-25"}]
[]
[null,null,"All figures shown above are in present day money terms. This means that your estimated benefits are shown in the equivalent of “today’s money.”"]
[null,null,null,null,null," "," "]
[]
[]
[null,"Reminder - Inputs"]
[null,null,"These are the values you entered on the \"Inputs\" page. If you need to amend the values, please use the \"Back to Inputs\" button "]
[]
[null,null,{"$f":"Input!D8","v":0},null,null,{"$f":"Input!D8","v":0}]
[null,null,"Full-Time Gross Annual Pensionable Pay (€)",null,null,null,{"$f":"Input!D16","v":0}]
{"$rows_left_out":15}
{"sheet":"Assumptions","index":3,"n_rows":2,"n_cols":2,"rows_kept":2,"cut":false,"hidden":false,"merged":[[1,1,1,7]]}
[]
[null,"ASSUMPTIONS"]

{"sheet":"Calculation","index":4,"n_rows":93,"n_cols":35,"rows_kept":93,"cut":false,"hidden":false,"merged":[[1,33,1,34],[25,14,25,15],[1,1,1,15],[25,3,25,6],[25,7,25,8],[3,11,16,11],[3,14,16,14]]}
[]
[null,"Single Scheme",null,null,null,null,null,null,null,null,null,null,null,null,null,null,null,null,null,null,null,null,null,null,null,null,null,null,null,null,null,null,null,"IGNORE - Designated and Comptroller Grades"]
[null,"Parameters",null,null,null,null,null,null,"2020 Onwards",null,null,null,"CPI rates - SS referable amounts",null,null,"Year","% of Year Worked","Reference Date",null,"CSP Cut-Off Dates",null,null,null,null,null,"CALCULATIONS",null,null,"CSP Rates",null,null,null,null,"Year End v Year Start",{"$f":"36 + IFERROR(Input!#REF!-2013, 0)","v":36}]
[null,"Accrual rates",null,null,null,null,null,null,"Bands",null,"ASC","Add CPI Years as is necessary",2013,"N/A","Add Years as is necessary - make sure formula in column Q is ",2013,{"$f":"IFERROR(IF(Input!$D$28=P4,0.5,IF(Input!$D$28>Calculation!P4,0,1)),\"\")","v":1},"2013-12-31",null,2017,"2017-01-01","2017-03-09","2017-12-31",null,null,"Service (Years)",null,null,"Yr","Start ","End ","CSP ",null,"This Cohort"]
[null,"Lump sum rate:",null,null,null,null,3.7499999999999999E-2,null,"<=€34500",34500,0,null,2014,0,null,2014,{"$f":"IFERROR(IF(Input!$D$28=P5,0.5,IF(Input!$D$28>Calculation!P5,0,1)),\"\")","v":1},"2014-12-31",null,2018,"2018-01-01","2018-03-25","2018-12-31",null,null,"Normal Pension Age:",{"$f":"IF(Input!$D$8=\"Uniform\",Input!$D$12,66)","v":66},null,2013,null,null,230.3,null,"OFFSET"]
[null,"Pension rate:",null,null,null,null,1.2500000000000001E-2,null,">34500 - <=€60000",60000,3.3300000000000003E-2,null,2015,1E-3,null,2015,{"$f":"IFERROR(IF(Input!$D$28=P6,0.5,IF(Input!$D$28>Calculation!P6,0,1)),\"\")","v":1},"2015-12-31",null,2019,"2019-01-01","2019-03-24","2019-12-31",null,null,"Projected service from current date forward (plus one year):",{"$f":"AA5-(YEAR(NOW())-Input!D24)+1","v":-1954},null,2014,null,null,230.3]
[null,"Low-pay rate:",null,null,null,null,5.7999999999999996E-3,null,">€60,000",null,3.5000000000000003E-2,null,2016,0,null,2016,{"$f":"IFERROR(IF(Input!$D$28=P7,0.5,IF(Input!$D$28>Calculation!P7,0,1)),\"\")","v":1},"2016-12-31",null,2020,"2020-01-01",null,"2020-12-31",null,null,"Year of Retirement",{"$f":"Input!D24+$AA$5","v":66},null,2015,null,null,230.3]
[null,"PR",null,null,null,null,0.03,null,null,null,null,null,2017,4.0000000000000001E-3,null,2017,{"$f":"IFERROR(IF(Input!$D$28=P8,0.5,IF(Input!$D$28>Calculation!P8,0,1)),\"\")","v":1},"2017-12-31",null,null,null,null,null,null,null,null,null,null,2016,null,null,233.3]
[null,"NPR",null,null,null,null,3.5000000000000003E-2,null,null,null,null,null,2018,7.0000000000000001E-3,null,2018,{"$f":"IFERROR(IF(Input!$D$28=P9,0.5,IF(Input!$D$28>Calculation!P9,0,1)),\"\")","v":1},"2018-12-31",null,null,null,null,null,null,null,"Benefits",null,null,2017,"2017-01-01","2017-03-08",233.3]
[null,"State Pension (€)",null,null,null,null,null,null,null,null,null,null,2019,1.2999999999999999E-2,null,2019,{"$f":"IFERROR(IF(Input!$D$28=P10,0.5,IF(Input!$D$28>Calculation!P10,0,1)),\"\")","v":1},"2019-12-31",null,null,null,null,null,null,null,"Projected Pension",{"$f":"SUM(P32:P87)","v":0}]
[null,"Weekly rate:",null,null,null,null,{"$f":"IF(TODAY()<AE13,AF13,AF15)","v":248.3},null,null,null,null,null,2020,0,null,2020,{"$f":"IFERROR(IF(Input!$D$28=P11,0.5,IF(Input!$D$28>Calculation!P11,0,1)),\"\")","v":1},"2020-12-31",null,null,null,null,null,null,null,null,null,null,2017,"2017-03-09","2017-12-31",238.3]
[null,null,null,null,null,null,null,null,null,null,null,null,null,null,null,2021,{"$f":"IFERROR(IF(Input!$D$28=P12,0.5,IF(Input!$D$28>Calculation!P12,0,1)),\"\")","v":1},{"$f":"TODAY()","v":"2021-05-25"},null,null,null,null,null,null,null,"Projected Lump Sum",{"$f":"SUM(N32:N87)","v":0},null,2018,"2018-01-01","2018-03-25",238.3]
[null,null,null,null,null,null,null,null,null,null,null,null,null,null,null,null,null,null,null,null,null,null,null,null,null,null,null,null,2018,"2018-03-26","2019-03-24",243.3]
[null,"Annual rate:",null,null,null,null,{"$f":"G11*52.18","v":12956.294},null,"Appear On Outputs Tab",null,null,null,null,null,null,null,null,null,null,null,null,null,null,null,null,"PV Pension",{"$f":"IF(OR(AD17=\"Judge\",AD17=\"TD/Senator\"),MIN($AA$10*(1+$G$21)^-($AA$6-1),$D$40*0.5),$AA$10*(1+$G$21)^-($AA$6-1))","v":0},null,2019,"2019-03-25",null,248.3]
[null,3.74,"* annual",null,null,null,{"$f":"G14*B15","v":48456.539560000005},null,null,null,null,null,null,null,null,null,null,null,null,null,null,null,null,null,null,"PV Lump Sum",{"$f":"IF(OR(AD17=\"Judge\",AD17=\"TD/Senator\"), MIN($AA$12*(1+$G$21)^-($AA$6-1),1.5*$D$40),$AA$12*(1+$G$21)^-($AA$6-1))","v":0},null,2020,null,null,248.3]
[null,"Annual rate of increase (nominal)"]
[null,"Salary (€)",null,null,null,null,null,null,null,null,null,null,null,null,null,null,null,null,null,null,null,null,null,null,null,"Contributions",null,null,"Membership Type",{"$f":"Input!D8","v":0}]
[null,"Annual rate of increase (nominal)",null,null,null,null,{"$f":"G19+G20","v":3.5000000000000003E-2},null,null,null,null,null,null,null,null,null,null,null,null,null,null,null,null,null,null,"PV EE CONT",{"$f":"SUM(K42:K87)","v":0}]
[null,"Real and Promotional pay growth",null,null,null,null,0.02,null,null,null,null,null,null,null,null,null,null,null,null,null,null,null,null,null,null,"PV EE CONT+ASC",{"$f":"SUM(L42:L87)","v":0}]
[null,"Inflation",null,null,null,null,1.4999999999999999E-2]
[null,"Deflation Factor",null,null,null,null,2.5000000000000001E-2,null,null,null,null,null,null,null,null,null,null,null,null,null,null,null,null,null,null,"Contributions"]
[null,null,null,null,null,null,null,null,null,null,null,null,null,null,null,null,null,null,null,null,null,null,null,null,null,"PV EE CONT",{"$f":"SUM(K42:K46)","v":0}]
[null,null,null,null,null,null,null,null,null,null,null,null,null,null,null,null,null,null,null,null,null,null,null,null,null,"PV EE CONT+ASC",{"$f":"SUM(L42:L46)","v":0}]
[]
[]
[null,"YEAR",null,"PROJECTED SALARY",null,null,null,"EE CONT",null,"ASC","PV EE CONT","PV EE CONT + PRD/ASC","Lump Sum",null,"Scheme Pension"]
[null,null,"% of Year Worked",null,"Offset","3.74*Offset","NPR","PR","NPR",null,null,null,"Accrued per year","Uprated with CPI","Accrued per year","Uprated with CPI"]
[null,null,null,null,null,null,null,null,null,null,null,null,null," "]
[null,null,null,null,null,null,null,{"$f":"$G$8","v":0.03},{"$f":"$G$9","v":3.5000000000000003E-2},{"$f":"SUM(J42:J87)","v":0}]
[]
[]
[null,2013,{"$f":"IFERROR(IF(Input!$D$28=B32,0.5,IF(Input!$D$28>Calculation!B32,0,1)),\"\")","v":1},{"$f":"IF(Input!$D$28>Calculation!B32,0,Input!E33)","v":0},{"$f":"230.3*52.18*2","v":24034.108},{"$f":"E32/2*$B$15","v":44943.78196},{"$f":"IFERROR(MAX(D32-E32,0),\"\")","v":0},null,null,null,null,null,{"$f":"IFERROR($G$5*(D32*MAX(Input!D33,0)*C32),\"\")","v":0},{"$f":"IFERROR(M32*(1+$N$5)*(1+$N$6)*(1+$N$7)*(1+$N$8)*(1+N$9)*(1+N$10)*(1+N$11)*(1+$G$20)^($AA$7-2020-1),\"\")","v":0},{"$f":"IFERROR(IF(D32<F32,D32*$G$7,((D32-F32)*$G$6)+($F$38*$G$7))*MAX(Input!D33,0)*C32, \"\")","v":0},{"$f":"IFERROR(O32*(1+$N$5)*(1+$N$6)*(1+$N$7)*(1+$N$8)*(1+N$9)*(1+N$10)*(1+N$11)*(1+$G$20)^($AA$7-2020-1),\"\")","v":0}]
[null,2014,{"$f":"IFERROR(IF(Input!$D$28=B33,0.5,IF(Input!$D$28>Calculation!B33,0,1)),\"\")","v":1},{"$f":"IF(Input!$D$28>Calculation!B33,0,Input!E34)","v":0},{"$f":"230.3*52.18*2","v":24034.108},{"$f":"E33/2*$B$15","v":44943.78196},0,null,null,null,null,null,{"$f":"IFERROR($G$5*(D33*MAX(Input!D34,0)*C33),\"\")","v":0},{"$f":"IFERROR(M33*(1+$N$6)*(1+$N$7)*(1+$N$8)*(1+N$9)*(1+N$10)*(1+N$11)*(1+$G$20)^($AA$7-2020-1),\"\")","v":0},{"$f":"IFERROR(IF(D33<F33,D33*$G$7,((D33-F33)*$G$6)+($F$38*$G$7))*MAX(Input!D34,0)*C33, \"\")","v":0},{"$f":"IFERROR(O33*(1+$N$6)*(1+$N$7)*(1+$N$8)*(1+N$9)*(1+N$10)*(1+N$11)*(1+$G$20)^($AA$7-2020-1),\"\")","v":0}]
[null,2015,{"$f":"IFERROR(IF(Input!$D$28=B34,0.5,IF(Input!$D$28>Calculation!B34,0,1)),\"\")","v":1},{"$f":"IF(Input!$D$28>Calculation!B34,0,Input!E35)","v":0},{"$f":"230.3*52.18*2","v":24034.108},44943.78196,0,null,null,null,null,null,{"$f":"IFERROR($G$5*(D34*MAX(Input!D35,0)*C34),\"\")","v":0},{"$f":"IFERROR(M34*(1+$N$7)*(1+$N$8)*(1+N$9)*(1+N$10)*(1+N$11)*(1+$G$20)^($AA$7-2020-1),\"\")","v":0},{"$f":"IFERROR(IF(D34<F34,D34*$G$7,((D34-F34)*$G$6)+($F$38*$G$7))*MAX(Input!D35,0)*C34, \"\")","v":0},{"$f":"IFERROR(O34*(1+$N$7)*(1+$N$8)*(1+N$9)*(1+N$10)*(1+N$11)*(1+$G$20)^($AA$7-2020-1),\"\")","v":0}]
[null,2016,{"$f":"IFERROR(IF(Input!$D$28=B35,0.5,IF(Input!$D$28>Calculation!B35,0,1)),\"\")","v":1},{"$f":"IF(Input!$D$28>Calculation!B35,0,Input!E36)","v":0},{"$f":"233.3*52.18*2","v":24347.188000000002},45529.241560000009,0,null,null,null,null,null,{"$f":"IFERROR($G$5*(D35*MAX(Input!D36,0)*C35),\"\")","v":0},{"$f":"IFERROR(M35*(1+$N$8)*(1+N$9)*(1+N$10)*(1+N$11)*(1+$G$20)^($AA$7-2020-1),\"\")","v":0},{"$f":"IFERROR(IF(D35<F35,D35*$G$7,((D35-F35)*$G$6)+($F$38*$G$7))*MAX(Input!D36,0)*C35, \"\")","v":0},{"$f":"IFERROR(O35*(1+$N$8)*(1+N$9)*(1+N$10)*(1+N$11)*(1+$G$20)^($AA$7-2020-1),\"\")","v":0}]
[null,2017,{"$f":"IFERROR(IF(Input!$D$28=B36,0.5,IF(Input!$D$28>Calculation!B36,0,1)),\"\")","v":1},{"$f":"IF(Input!$D$28>Calculation!B36,0,Input!E37)","v":0},{"$f":" (YEARFRAC(U4,V4)*233.3+YEARFRAC(V4,W4)*238.3)*52.18*2","v":24770.425777777778},46320.696204444452,0,null,null,null,null,null,{"$f":"IFERROR($G$5*(D36*MAX(Input!D37,0)*C36),\"\")","v":0},{"$f":"IFERROR(M36*(1+$N$9)*(1+N$10)*(1+N$11)*(1+$G$20)^($AA$7-2020-1),\"\")","v":0},{"$f":"IFERROR(IF(D36<F36,D36*$G$7,((D36-F36)*$G$6)+($F$38*$G$7))*MAX(Input!D37,0)*C36, \"\")","v":0},{"$f":"IFERROR(O36*(1+$N$9)*(1+N$10)*(1+N$11)*(1+$G$20)^($AA$7-2020-1),\"\")","v":0}]
[null,2018,{"$f":"IFERROR(IF(Input!$D$28=B37,0.5,IF(Input!$D$28>Calculation!B37,0,1)),\"\")","v":1},{"$f":"IF(Input!$D$28>Calculation!B37,0,Input!E38)","v":0},{"$f":" (YEARFRAC(U5,V5)*238.3+YEARFRAC(V5,W5)*243.3)*52.18*2","v":25269.03466666667},{"$f":"E37/2*$B$15","v":47253.094826666675},{"$f":"IFERROR(MAX(D37-E37,0),\"\")","v":0},null,null,null,null,null,{"$f":"IFERROR($G$5*(D37*MAX(Input!D38,0)*C37),\"\")","v":0},{"$f":"IFERROR(M37*(1+N$10)*(1+N$11)*(1+$G$20)^($AA$7-2020-1),\"\")","v":0},{"$f":"IFERROR(IF(D37<F37,D37*$G$7,((D37-F37)*$G$6)+($F$38*$G$7))*MAX(Input!D38,0)*C37, \"\")","v":0},{"$f":"IFERROR(O37*(1+N$10)*(1+N$11)*(1+$G$20)^($AA$7-2020-1),\"\")","v":0}]
[null,2019,{"$f":"IFERROR(IF(Input!$D$28=B38,0.5,IF(Input!$D$28>Calculation!B38,0,1)),\"\")","v":1},{"$f":"IF(Input!$D$28>Calculation!B38,0,Input!E39)","v":0},{"$f":"(YEARFRAC(U6,V6)*243.3+YEARFRAC(V6,W6)*248.3)*52.18*2","v":25792.284111111112},{"$f":"E38/2*$B$15","v":48231.571287777784},{"$f":"IFERROR(MAX(D38-E38,0),\"\")","v":0},null,null,null,null,null,{"$f":"IFERROR($G$5*(D38*MAX(Input!D39,0)*C38),\"\")","v":0},{"$f":"IFERROR(M38*(1+N$11)*(1+$G$20)^($AA$7-2020-1),\"\")","v":0},{"$f":"IFERROR(IF(D38<F38,D38*$G$7,((D38-F38)*$G$6)+($F$38*$G$7))*MAX(Input!D39,0)*C38, \"\")","v":0},{"$f":"IFERROR(O38*(1+N$11)*(1+$G$20)^($AA$7-2020-1),\"\")","v":0}]
[null,2020,{"$f":"IFERROR(IF(Input!$D$28=B39,0.5,IF(Input!$D$28>Calculation!B39,0,1)),\"\")","v":1},{"$f":"IF(Input!$D$28>Calculation!B39,0,Input!E40)","v":0},{"$f":" $G$11*52.18*2","v":25912.588},{"$f":"E39/2*$B$15","v":48456.539560000005},{"$f":"IFERROR(MAX(D39-E39,0),\"\")","v":0},null,null,null,null,null,{"$f":"IFERROR($G$5*(D39*MAX(Input!D40,0)*C39),\"\")","v":0},{"$f":"IFERROR(M39*(1+$G$20)^($AA$7-2020-1),\"\")","v":0},{"$f":"IFERROR(IF(D39<F39,D39*$G$7,((D39-F39)*$G$6)+($F$38*$G$7))*MAX(Input!D40,0)*C39, \"\")","v":0},{"$f":"IFERROR(O39*(1+$G$20)^($AA$7-2020-1),\"\")","v":0}]
[null,2021,{"$f":"IFERROR(IF(Input!$D$28=B40,0.5,IF(Input!$D$28>Calculation!B40,0,1)),\"\")","v":1},{"$f":"IF(Input!$D$28>Calculation!B40,0,Input!D16)","v":0},{"$f":" $G$11*52.18*2","v":25912.588},{"$f":"E40/2*$B$15","v":48456.539560000005},{"$f":"IFERROR(MAX(D40-E40,0),\"\")","v":0},null,null,null,null,null,{"$f":"IFERROR($G$5*(D40*Input!$D$20*C40),\"\")","v":0},{"$f":"IFERROR(M40*(1+$G$20)^($AA$7-2021-1),\"\")","v":0},{"$f":"IFERROR(IF(D40<F40,D40*$G$7,((D40-F40)*$G$6)+($F$39*$G$7))*MAX(Input!$D$20,0)*C40,\"\")","v":0},{"$f":"IFERROR(O40*(1+$G$20)^($AA$7-2021-1),\"\")","v":0}]
{"$rows_left_out":54}
{"sheet":"Version Control","index":5,"n_rows":9,"n_cols":3,"rows_kept":9,"cut":false,"hidden":true,"merged":[[1,1,2,1],[1,2,2,2],[6,1,9,1]]}
[]
[null,"Resource Toolkit","Single Scheme Administration Project (Phase 1)\nMember Resources"]
[]
[null,"Resource Name","Single Public Service Scheme Member's Estimator Tool (for all Grades)"]
[null,"Description","This Estimator Tool is designed to give a broad indication of the normal retirement benefits for a member of the Single Scheme at normal retirement age\n"]
[null,"Version  ","V1  (22/01/2021)"]
[null,"Version Comments","V1 test launch //2020 \nFormula for NRA was\n''=IF(Input!$D$8=\"Uniform\",Input!$D$12,IF(Input!D24<1949,65,IF(AND(Input!D24>=1949,Input!D24<1955),66,IF(AND(Input!D24>=1955,Input!D24<1961),67,68))))\nNOW IT IS\n''=IF(Input!$D$8=\"Uniform\",Input!$D$12,66)"]
[null,null,"Updated for 2020"]
[null,null,"CPI Rate of ???? Applied"]