{"text_format":"1","workbook":"xlsx","n_sheets":6,"sheets":["Disclaimer","Input","Output","Assumptions","Version Control","Calculation"],"not_rendered":{"charts":0,"images":0,"macros":1,"external_links":0,"defined_names":2,"comments":1,"pivot_tables":0},"unopened":[],"bounds":{"document_bytes":16777216,"sheet_cells":100000,"rows_first":2000,"rows_last":500,"rows_between":2000,"halvings":0,"cell_chars":16384,"cell_head_chars":4096},"cells_cut":0,"cells_raw":0,"read":"row_number_cap","date_system":"1900"}

{"sheet":"Disclaimer","index":0,"n_rows":2,"n_cols":2,"rows_kept":2,"cut":false,"hidden":false,"merged":[]}
[]
[null,"Single Scheme Uniformed Accrual Estimator Tool - Disclaimer"]

{"sheet":"Input","index":1,"n_rows":143,"n_cols":5,"rows_kept":143,"cut":false,"hidden":true,"merged":[[38,1,39,7],[0,1,2,7],[35,2,35,7],[3,2,3,7],[21,2,21,7],[13,2,13,7],[17,2,17,7],[25,2,25,7],[8,2,8,7]],"read":"row_number_cap"}
[null,"SINGLE PUBLIC SERVICE PENSION SCHEME (THE \"SINGLE SCHEME\") \nUNIFORMED ACCRUAL ESTIMATOR TOOL  - INPUTS"]
[]
[]
[null,null,"This Uniformed Accrual Estimator Tool is designed to give a broad indication of retirement benefits for a Uniformed Accrual member of the Single Scheme at normal retirement age. The outputs from the Estimator Tool are not a guarantee of the retirement benefits payable at your normal retirement age. For a broad estimate of your projected Single Scheme benefits, please provide the following information:"]
[]
[]
[null,null,"Uniformed Accrual Rank / Grade"]
[null,null,"Select",null,{"$f":"IF(E12=\"\",\"\",\"Enter Full-Time Annual Pensionable Pay here\")","v":""}]
[]
[]
[]
[null,null,"Full-Time Gross Annual Pensionable Pay (€)"]
[null,null,"€",null,{"$f":"IF(E17=\"\",\"\",\"Enter Full-Time Annual Pensionable Pay here\")","v":"Enter Full-Time Annual Pensionable Pay here"}]
[null,null,"Include all of your approved pensionable allowances"]
[]
[null,null,"% Work Pattern or Full Time Equivalent (FTE)"]
[null,null,"%",null,{"$f":"IF(D17<1,\"If your work pattern is less than 100%, make sure you enter the equivalent Full Time Pensionable Pay you would receive if you worked a full time pattern in the field Full Time Gross Annual Pensionable Pay above\",\"\")","v":"If your work pattern is less than 100%, make sure you enter the equivalent Full Time Pensionable Pay you would receive if you worked a full time pattern in the field Full Time Gross Annual Pensionable Pay above"}]
[null,null,"Enter your % work pattern, to a maximum of 100%"]
[]
[null,null,"Year of Birth"]
[null,null,"Year"]
[]
[]
[null,null,"Year of Entry to the Single Scheme"]
[null,null,"Year",null,"In order to give as complete an estimate as possible you should select the year when you first entered pensionable, Single Scheme employment. "]
[]
[null,null,"Work Pattern and Full Time Pensionable Pay in previous years"]
[null,null,"Year","Annual Work Pattern (%)","Full-Time Gross Annual Pensionable Pay (€)"]
[null,null,2013]
[null,null,2014]
[null,null,2015]
[null,null,2016]
[null,null,2017]
[null,null,2018]
[null,null,2019]
[]
[]
[]
[]
[]
{"$rows_left_out":104}
{"sheet":"Output","index":2,"n_rows":53,"n_cols":8,"rows_kept":53,"cut":false,"hidden":true,"merged":[[38,5,38,6],[36,2,36,6],[31,2,31,6],[0,1,0,7],[16,2,16,6],[19,2,19,6],[15,2,15,6],[1,2,3,7],[8,2,8,6],[6,5,6,6],[35,1,35,7],[28,2,28,4]]}
[null,"SINGLE SCHEME UNIFORMED ACCRUAL ESTIMATOR TOOL - RESULTS"]
[null,null,"See below an estimate of your projected Single Scheme benefits, in present day money terms,  based on information you have provided and assumptions listed."]
[]
[]
[]
[null,null,"Contributions This Year"]
[null,null,"Scheme Contributions",null,null,"Additional Supperannuation Contribution (ASC)"]
[null,null,"€",{"$f":"Calculation!H45+Calculation!I45","v":0}," ","€",{"$f":"Calculation!J45","v":0}]
[null,null,{"$f":"\"Based on your inputs, you are projected to pay €\"&TEXT(ROUND(D8,0),\"##,###\")& \" in employee contributions and €\"&TEXT(ROUND(G8,0),\"##,###\")&\" in Additional Superannuation Contributions over the next 12 months.\"","v":"Based on your inputs, you are projected to pay € in employee contributions and € in Additional Superannuation Contributions over the next 12 months."}]
[]
[null,null,"Retirement Benefits Built Up This Year"]
[null,null,{"$f":"\"Your normal retirement age is: \"&Calculation!S5","v":"Your normal retirement age is: "}]
[]
[null,null,"Retirement Pension Benefit ",null,null,"Retirement Lump Sum Benefit"]
[null,null,"€",{"$f":"Calculation!O43","v":0},"p.a.","€",{"$f":"Calculation!M43","v":0}]
[null,null,{"$f":"\"On the basis of your inputs, you are expected to build up €\"&TEXT(ROUND($D$15,2),\"##,###\")&\" towards your annual pension entitlement and €\"&TEXT(ROUND($G$15,2),\"##,###\")&\" towards your retirement lump sum payment over the next 12 months.\"","v":"On the basis of your inputs, you are expected to build up € towards your annual pension entitlement and € towards your retirement lump sum payment over the next 12 months."}]
[null,null,{"$f":"\"The benefits built-up above will be payable from your normal retirement age, i.e. age \"&Calculation!S5&\". Your pension and lump sum benefits will be uprated in line with changes in the Consumer Price Index between the year of building up these benefits and the year of your retirement.\"","v":"The benefits built-up above will be payable from your normal retirement age, i.e. age . Your pension and lump sum benefits will be uprated in line with changes in the Consumer Price Index between the year of building up these benefits and the year of your retirement."}]
[]
[null,null,"Estimated Benefits At Retirement"]
[null,null,"Please refer to all assumptions for further detail on how these estimates have been derived."]
[]
[null,null,"Normal Retirement Year",null,null,"Year ",{"$f":"Calculation!S7","v":{"$error":"#VALUE!"}}]
[]
[null,null,"Single Scheme Retirement Lump Sum",null,null,"€",{"$f":"Calculation!S14","v":{"$error":"#VALUE!"}}]
[]
[null,null,"Single Scheme Annual Retirement Pension",null,null,"€",{"$f":"Calculation!S13","v":{"$error":"#VALUE!"}},"p.a."]
[]
[null,null,"Annual Contributory State Pension",null,null,"€",{"$f":"Calculation!G12","v":12956.294},"p.a."]
[null,null,"You are assumed to be eligible to receive the full Contributory State Pension from your state pension eligibility age. Your Single Scheme Uniformed Accrual Normal Retirement Age and the Contributory State Pension eligibility age are not the same. "]
[null,null,"Today's Date",null,null,null,{"$f":"TODAY()","v":"2020-07-08"}]
[]
[null,null,"All figures shown above are in present day money terms. This means that your estimated benefits are shown in the equivalent of “today’s money.”"]
[null,null,null,null,null," "," "]
[]
[]
[null,"Reminder - Inputs"]
[null,null,"These are the values you entered on the \"Inputs\" page. If you need to amend the values, please use the \"Back to Inputs\" button "]
[]
[null,null,"Uniformed Accrual Rank and Grade",null,null,{"$f":"Input!D8","v":0}]
[null,null,"Full-Time Gross Annual Pensionable Pay (€)",null,null,null,{"$f":"Input!D13","v":0}]
{"$rows_left_out":14}
{"sheet":"Assumptions","index":3,"n_rows":2,"n_cols":2,"rows_kept":2,"cut":false,"hidden":true,"merged":[]}
[]
[null,"ASSUMPTIONS"]

{"sheet":"Version Control","index":4,"n_rows":10,"n_cols":3,"rows_kept":10,"cut":false,"hidden":true,"merged":[[1,1,2,1],[1,2,2,2],[6,1,9,1]]}
[]
[null,"Resource Toolkit","Single Scheme Administration Project (Phase 1)\nMember Resources"]
[]
[null,"Resource Name","Single Public Service Scheme Member's Estimator Tool (for Standard Grades)"]
[null,"Description","This Estimator Tool is designed to give a broad indication of the normal retirement benefits for a standard grade member of the Single Scheme at normal retirement age \n"]
[null,"Version  ","V1.1  (22/05/2018)"]
[null,"Version Comments","V1 test launch 9/05/2018 "]
[null,null,"V1.1 - Added Reminder of Input details to Output Sheet.  Added detail re present day money terms. Formatting of \"Standard Grade\" changed. CPI 2015 (Calculations _ N6) changed to correct CPI of 0.001."]
[null,null,"v2 20/07/2018 change to calculations sheet - promotional pay increase 1% p.a.. Issue resolved on output sheet where rows not hiding. "]
[null,null,"v3 tbc Annual updates for 2019"]

{"sheet":"Calculation","index":5,"n_rows":96,"n_cols":24,"rows_kept":96,"cut":false,"hidden":true,"merged":[[29,14,29,15],[1,1,1,15],[29,3,29,6],[29,7,29,8]]}
[]
[null,"Single Scheme",null,null,null,null,null,null,null,null,null,null,null,null,null,null,null,null,null,null,"Yr","Start ","End ","CSP "]
[null,"Parameters",null,null,null,null,null,null,"2020 Onwards",null,null,null,"CPI rates - SS referable amounts",null,null,null,null,"CALCULATIONS",null,null,2013,null,null,230.3]
[null,"Accrual rates",null,null,null,null,null,null,"Bands",null,"ASC",null,null,null,null,null,null,"Service (Years)",null,null,2014,null,null,230.3]
[null,"Lump sum rate:",null,null,null,null,4.2900000000000001E-2,null,"<=€34500",34500,0,null,2014,0,null,{"$f":" IF(Input!$D$8=\"An Garda Siochana - Garda / Sergeant / Inspector / Superintendent - Retirement Age 55\",55,IF(Input!$D$8=\"Irish Prison Service - Prison Officer grades - Retirement Age 55\",55,IF(Input!$D$8=\"Local Authority Fire Service - Career Firefighter - Retirement Age 55\",55,IF(Input!$D$8=\"Permanent Defence Forces - Private / Corporal / Sergeant / Second Lieutenant / Lieutenant - Retirement Age 50\",50, IF(Input!$D$8=\"Permanent Defence Forces - CQMS / Company Sergeant / QMS / Sergeant Major - Retirement Age 56\",56, \"\")))))","v":""},null,"Normal Pension Age:",{"$f":" IF(Input!$D$8=\"An Garda Síochána - Retirement Age 55\",55,IF(Input!$D$8=\"Irish Prison Service - Retirement Age 55\",55,IF(Input!$D$8=\"Local Authority Career Firefighter - Retirement Age 55\",55,IF(Input!$D$8=\"Permanent Defence Force - Retirement Age 50\",50, IF(Input!$D$8=\"Permanent Defence Force - Retirement Age 56\",56, IF(Input!$D$8=\"Permanent Defence Force - Retirement Age 58\",58, IF(Input!$D$8=\"Permanent Defence Force - Retirement Age 60\",60, \"\")))))))","v":""},null,2015,null,null,230.3]
[null,"Pension rate:",null,null,null,null,1.43E-2,null,">34500 - <=€60000",60000,3.3300000000000003E-2,null,2015,1E-3,null,null,null,"Projected service from current date forward (plus one year):",{"$f":"S5-(YEAR(NOW())-Input!D21)+1","v":{"$error":"#VALUE!"}},null,2016,null,null,233.3]
[null,"Low-pay rate:",null,null,null,null,5.7999999999999996E-3,null,">€60,000",null,3.5000000000000003E-2,null,2016,0,null,null,null,"Year of Retirement",{"$f":"Input!D21+$S$5","v":{"$error":"#VALUE!"}},null,2017,"2017-01-01","2017-03-08",233.3]
[null,null,null,null,null,null,null,null,null,null,null,null,2017,4.0000000000000001E-3,null,null,null,null,null,null,2017,"2017-03-09","2017-12-31",238.3]
[null,"State Pension (€)",null,null,null,null,null,null,null,null,null,null,2018,7.0000000000000001E-3,null,null,null,"Benefits",null,null,2018,"2018-01-01","2018-03-25",238.3]
[null,"Weekly rate:",null,null,null,null,{"$f":"IF(TODAY()<W10,X10,X11)","v":248.3},null,null,null,null,null,2019,1.2999999999999999E-2,null,null,null,"Projected Pension",{"$f":"SUM(P36:P90)","v":0},null,2018,"2018-03-26","2019-03-24",243.3]
[null,null,null,null,null,null,null,null,null,null,null,null,null,null,null,null,null,"Projected Lump Sum",{"$f":"SUM(N36:N90)","v":0},null,2019,"2019-03-25","2019-12-31",248.3]
[null,"Annual rate:",null,null,null,null,{"$f":"G10*52.18","v":12956.294},null,null,null,null,null,"Year","% of Year Worked","Reference Date"]
[null,3.74,"* annual",null,null,null,{"$f":"G12*B13","v":48456.539560000005},null,null,null,null,null,2013,{"$f":"IFERROR(IF(Input!$D$25=M13,0.5,IF(Input!$D$25>Calculation!M13,0,1)),\"\")","v":1},"2013-12-31",null,null,"PV Pension",{"$f":"$S$10*(1+$G$19)^-($S$6-1)","v":{"$error":"#VALUE!"}}]
[null,"Annual rate of increase (nominal)",null,null,null,null,null,null,null,null,null,null,2014,{"$f":"IFERROR(IF(Input!$D$25=M14,0.5,IF(Input!$D$25>Calculation!M14,0,1)),\"\")","v":1},"2014-12-31",null,null,"PV Lump Sum",{"$f":"S11*(1+$G$19)^-($S$6-1)","v":{"$error":"#VALUE!"}}]
[null,"Salary (€)",null,null,null,null,null,null,null,null,null,null,2015,{"$f":"IFERROR(IF(Input!$D$25=M15,0.5,IF(Input!$D$25>Calculation!M15,0,1)),\"\")","v":1},"2015-12-31"]
[null,"Annual rate of increase (nominal)",null,null,null,null,{"$f":"G17+G18","v":3.5000000000000003E-2},null,null,null,null,null,2016,{"$f":"IFERROR(IF(Input!$D$25=M16,0.5,IF(Input!$D$25>Calculation!M16,0,1)),\"\")","v":1},"2016-12-31",null,null,"Contributions"]
[null,"Real and Promotional pay growth",null,null,null,null,0.02,null,null,null,null,null,2017,{"$f":"IFERROR(IF(Input!$D$25=M17,0.5,IF(Input!$D$25>Calculation!M17,0,1)),\"\")","v":1},"2017-12-31",null,null,"PV EE CONT",{"$f":"SUM(K45:K90)","v":0}]
[null,"Inflation",null,null,null,null,1.4999999999999999E-2,null,null,null,null,null,2018,{"$f":"IFERROR(IF(Input!$D$25=M18,0.5,IF(Input!$D$25>Calculation!M18,0,1)),\"\")","v":1},"2018-12-31",null,null,"PV EE CONT+ASC",{"$f":"SUM(L45:L90)","v":0}]
[null,"Deflation Factor",null,null,null,null,2.5000000000000001E-2,null,null,null,null,null,2019,{"$f":"IFERROR(IF(Input!$D$25=M19,0.5,IF(Input!$D$25>Calculation!M19,0,1)),\"\")","v":1},"2019-12-31"]
[null,null,null,null,null,null,null,null,null,null,null,null,2020,{"$f":"IFERROR(IF(Input!$D$25=M20,0.5,IF(Input!$D$25>Calculation!M20,0,1)),\"\")","v":1},{"$f":"TODAY()","v":"2020-07-08"}]
[]
[null,null,null,null,null,null,null,null,null,null,null,null,"CSP Cut-Off Dates"]
[null,null,null,null,null,null,null,null,null,null,null,null,2017,"2017-01-01","2017-03-09","2017-12-31"]
[null,null,null,null,null,null,null,null,null,null,null,null,2018,"2018-01-01","2018-03-25","2018-12-31"]
[null,null,null,null,null,null,null,null,null,null,null,null,2019,"2019-01-01","2019-03-24","2019-12-31"]
[null,null,null,null,null,null,null,null,null,null,null,null,2020,"2020-01-01",null,"2020-12-31"]
[]
[]
[]
[null,"YEAR",null,"PROJECTED SALARY",null,null,null,"EE CONT",null,"ASC","PV EE CONT","PV EE CONT + PRD/ASC","Lump Sum",null,"Scheme Pension"]
[null,null,"% of Year Worked","PR","Offset","3.74*Offset","NPR","PR","NPR",null,null,null,"Accrued per year","Uprated with CPI","Accrued per year","Uprated with CPI"]
[null,null,null,null,null,null,null,null,null,null,null,null,null," "]
[null,null,null,null,null,null,null,3.3000000000000002E-2,4.2000000000000003E-2,{"$f":"SUM(J45:J90)","v":0}]
[]
[]
[null,2013,{"$f":"IFERROR(IF(Input!$D$25=B36,0.5,IF(Input!$D$25>Calculation!B36,0,1)),\"\")","v":1},{"$f":"IF(Input!$D$25>Calculation!B36,0,Input!E29)","v":0},{"$f":"230.3*52.18*2","v":24034.108},{"$f":"E36/2*$B$13","v":44943.78196},{"$f":"IFERROR(MAX(D36-E36,0),\"\")","v":0},null,null,null,null,null,{"$f":"IFERROR($G$5*(D36*MAX(Input!D29,0)*C36),\"\")","v":0},{"$f":"IFERROR(M36*(1+$N$5)*(1+$N$6)*(1+$N$7)*(1+$N$8)*(1+N$9)*(1+N$10)*(1+$G$18)^($S$7-2019-1),\"\")","v":""},{"$f":"IFERROR(IF(D36<F36,D36*$G$7,((D36-F36)*$G$6)+($F$36*$G$7))*MAX(Input!D29,0)*C36,\"\")","v":0},{"$f":"IFERROR(O36*(1+$N$5)*(1+$N$6)*(1+$N$7)*(1+$N$8)*(1+N$9)*(1+$G$18)^($S$7-2019-1),\"\")","v":""}]
[null,2014,{"$f":"IFERROR(IF(Input!$D$25=B37,0.5,IF(Input!$D$25>Calculation!B37,0,1)),\"\")","v":1},{"$f":"IF(Input!$D$25>Calculation!B37,0,Input!E30)","v":0},{"$f":"230.3*52.18*2","v":24034.108},{"$f":"E37/2*$B$13","v":44943.78196},0,null,null,null,null,null,{"$f":"IFERROR($G$5*(D37*MAX(Input!D30,0)*C37),\"\")","v":0},{"$f":"IFERROR(M37*(1+$N$6)*(1+$N$7)*(1+$N$8)*(1+N$9)*(1+N$10)*(1+$G$18)^($S$7-2019-1),\"\")","v":""},{"$f":"IFERROR(IF(D37<F37,D37*$G$7,((D37-F37)*$G$6)+($F$37*$G$7))*MAX(Input!D30,0)*C37,\"\")","v":0},{"$f":"IFERROR(O37*(1+$N$6)*(1+$N$7)*(1+$N$8)*(1+N$9)*(1+N$10)*(1+$G$18)^($S$7-2019-1),\"\")","v":""}]
[null,2015,{"$f":"IFERROR(IF(Input!$D$25=B38,0.5,IF(Input!$D$25>Calculation!B38,0,1)),\"\")","v":1},{"$f":"IF(Input!$D$25>Calculation!B38,0,Input!E31)","v":0},{"$f":"230.3*52.18*2","v":24034.108},44943.78196,0,null,null,null,null,null,{"$f":"IFERROR($G$5*(D38*MAX(Input!D31,0)*C38),\"\")","v":0},{"$f":"IFERROR(M38*(1+$N$7)*(1+$N$8)*(1+N$9)*(1+N$10)*(1+$G$18)^($S$7-2019-1),\"\")","v":""},{"$f":"IFERROR(IF(D38<F38,D38*$G$7,((D38-F38)*$G$6)+($F$38*$G$7))*MAX(Input!D31,0)*C38,\"\")","v":0},{"$f":"IFERROR(O38*(1+$N$7)*(1+$N$8)*(1+N$9)*(1+N$10)*(1+$G$18)^($S$7-2019-1),\"\")","v":""}]
[null,2016,{"$f":"IFERROR(IF(Input!$D$25=B39,0.5,IF(Input!$D$25>Calculation!B39,0,1)),\"\")","v":1},{"$f":"IF(Input!$D$25>Calculation!B39,0,Input!E32)","v":0},{"$f":"233.3*52.18*2","v":24347.188000000002},45529.241560000009,0,null,null,null,null,null,{"$f":"IFERROR($G$5*(D39*MAX(Input!D32,0)*C39),\"\")","v":0},{"$f":"IFERROR(M39*(1+$N$8)*(1+N$9)*(1+N$10)*(1+$G$18)^($S$7-2019-1),\"\")","v":""},{"$f":"IFERROR(IF(D39<F39,D39*$G$7,((D39-F39)*$G$6)+($F$39*$G$7))*MAX(Input!D32,0)*C39,\"\")","v":0},{"$f":"IFERROR(O39*(1+$N$8)*(1+N$9)*(1+N$10)*(1+$G$18)^($S$7-2019-1),\"\")","v":""}]
[null,2017,{"$f":"IFERROR(IF(Input!$D$25=B40,0.5,IF(Input!$D$25>Calculation!B40,0,1)),\"\")","v":1},{"$f":"IF(Input!$D$25>Calculation!B40,0,Input!E33)","v":0},{"$f":"(YEARFRAC(N23,O23)*233.3+YEARFRAC(O23,P23)*238.3)*52.18*2","v":24770.425777777778},46320.696204444452,0,null,null,null,null,null,{"$f":"IFERROR($G$5*(D40*MAX(Input!D33,0)*C40),\"\")","v":0},{"$f":"IFERROR(M40*(1+$N$9)*(1+N$10)*(1+$G$18)^($S$7-2019-1),\"\")","v":""},{"$f":"IFERROR(IF(D40<F40,D40*$G$7,((D40-F40)*$G$6)+($F$40*$G$7))*MAX(Input!D33,0)*C40,\"\")","v":0},{"$f":"IFERROR(O40*(1+$N$9)*(1+N$10)*(1+$G$18)^($S$7-2019-1),\"\")","v":""}]
{"$rows_left_out":56}